Loading
Round 1: Completed Round 2: Completed #instance_segmentation
30.3k
1025
39
1272
ID Participant Status AP AR ▼ Message Submission
215328 mostafa_farshchi failed 0.000 0.000
View
180763 gaurav_singhal failed 0.000 0.000

Exception: Timeout, current speed: 1.7110776543617248/image, timeout speed: 1.5/image


View Code
179514 lapp09 failed 0.000 0.000

KeyError: 144


View Code
179512 lapp09 failed 0.000 0.000

JSONDecodeError: Expecting property name enclosed in double quotes: line 1 column 2 (char 1)


View Code
181373 Mykola_Lavreniuk failed 0.000 0.000

SSL connect error


View
181814 gaurav_singhal failed 0.000 0.000

Exception: Timeout, current speed: 1.5547730355035692/image, timeout speed: 1.5/image


View Code
176673 jesusmolrdv failed 0.000 0.000

ZeroDivisionError: float division by zero


View Code
181709 jesusmolrdv failed 0.000 0.000

Exception: Timeout, current speed: 1.7751328263963972/image, timeout speed: 1.5/image


View Code
178746 lapp09 failed 0.000 0.000

Inference failed


View Code
177149 saidinesh_pola failed 0.000 0.000

FileNotFoundError: [Errno 2] No such file or directory: โ€˜classes.jsonโ€™


View Code