Loading
0 Follower
0 Following
weel2019

Location

HK

Badges

2
1
1

Activity

May
Jun
Jul
Aug
Sep
Oct
Nov
Dec
Jan
Feb
Mar
Apr
May
Mon
Wed
Fri

Ratings Progression

Loading...

Challenge Categories

Loading...

Challenges Entered

A dataset and open-ended challenge for music recommendation research

Latest submissions

No submissions made in this challenge.

Sample-efficient reinforcement learning in Minecraft

Latest submissions

No submissions made in this challenge.

Sample-efficient reinforcement learning in Minecraft

Latest submissions

See All
graded 25175
graded 25174
graded 25162
Participant Rating
Participant Rating
  • xt NeurIPS 2019 : MineRL Competition
    View

NeurIPS 2019 : MineRL Competition

When will the results of round 1 be announced?

Over 4 years ago

Any official update ?

Announcement - Round 1 Scores

Over 4 years ago

Thanks for your check.

Announcement - Round 1 Scores

Over 4 years ago

Thanks for update!
but,has the minerl updated to 0.2.6 ?

Collecting minerl==0.2.5
  ERROR: Could not find a version that satisfies the requirement minerl==0.2.5 (from versions: 0.1.0, 0.1.1, 0.1.2, 0.1.3, 0.1.4, 0.1.5, 0.1.6, 0.1.8, 0.1.9, 0.1.10, 0.1.11, 0.1.12, 0.1.13, 0.1.14, 0.1.16, 0.1.17, 0.1.18, 0.2.0, 0.2.1, 0.2.2, 0.2.6)
ERROR: No matching distribution found for minerl==0.2.5

Equip item failed

Over 4 years ago

sorry, i haven’t solved it yet. @GrizzlyRL2019

Equip item failed

Over 4 years ago

Thanks @kaixin, we have check the next 2 step, but doesn’t works.

And, the other question is that the maxDamage.type if not a Enum, it’s a string:

{'mainhand': {'damage': 0,
   'maxDamage': -1,
      'type': 'stick'}

Equip item failed

Over 4 years ago

I’ve tries equipping the item wooden_pickaxe with ('equip', 3), but i found that the type in current states still are stick. Has anyone encountered this problem? Thanks.

n [48]: b                                                                                                       
Out[48]: 
OrderedDict([('forward', 0),
             ('back', 0),
             ('left', 0),
             ('right', 0),
             ('jump', 0),
             ('sneak', 0),
             ('sprint', 0),
             ('attack', 0),
             ('camera', array([0., 0.], dtype=float32)),
             ('place', 0),
             ('equip', 3),
             ('craft', 0),
             ('nearbyCraft', 0),
             ('nearbySmelt', 0)])

  
In [49]: s,r,done,info=env.step(b)                                                                     

In [50]: s                                                                                                       
Out[50]: 
{'equipped_items': {'mainhand': {'damage': 0,
   'maxDamage': -1,
      'type': 'stick'}},
       'inventory': {'coal': 0,
       'cobblestone': 0,
       'crafting_table': 0,
       'dirt': 0,
       'furnace': 0,
       'iron_axe': 0,
       'iron_ingot': 0,
       'iron_ore': 0,
       'iron_pickaxe': 0,
       'log': 0,
       'planks': 9,
       'stick': 14,
       'stone': 0,
       'stone_axe': 0,
       'stone_pickaxe': 0,
       'torch': 0,
       'wooden_axe': 0,
       'wooden_pickaxe': 1},

Available environments during training

Over 4 years ago

Thanks, @jazzpiano3 From the rule,it’s 8M total (for all the environments). I thinks i would have misunderstood about above info.

Available environments during training

Over 4 years ago

@BrandonHoughton In other words, during the training stage, we can use >>> 8M step in other’s environments, besides the MineRLObtainDiamond-v0.

For example, we can use 10 million step in Treechop, and we can use 20 million step on MineRLObtainIronPickaxe-v0,… etc, and we just make sure that step in ObtainDiamond-v0 < 8 million?

Is it correct? Thanks

What is considered an internal reward?

Almost 5 years ago

Hi, @BrandonHoughton . If we use supervised learning algorithms to extract some rules from the MineRLdataset, and then in the process of reinforcement learning, these rules will be set as Non-trainable , is this permitted?

Thanks

Issues downloading the dataset

Almost 5 years ago

if someone make sure this dataset hava 60 million (state-action-reward)?

I’m download data_texture_0_low_res.tar.gz, only ~8M samples ?

MineRLTreechop-v0 426699
MineRLObtainIronPickaxe-v0 1401485
MineRLNavigateDense-v0 235786
MineRLObtainDiamond-v0 1780457
MineRLNavigateExtreme-v0 268744
MineRLNavigateDense-v0 235786
MineRLNavigateExtremeDense-v0 268326
MineRLObtainDiamondDense-v0 1780457
MineRLObtainIronPickaxeDense-v0 1401485
total_count 7799225

Sample efficiency and human dataset

Almost 5 years ago

I have a question, if we use more than a state in once interaction. and the server will how to count the sample count?

e.g, likes the baselines code on Gym.step, they may used 4 states in once step refer to the agent, therefore, we could only use 8,000,000/4 = 2,000,000 step in training stage? Please help to make sure with it, Thanks.

    def step(self, action):
        """Repeat action, sum reward, and max over last observations."""
        total_reward = 0.0
        done = None
        for i in range(self._skip):
            obs, reward, done, info = self.env.step(action)
            if i == self._skip - 2: self._obs_buffer[0] = obs
            if i == self._skip - 1: self._obs_buffer[1] = obs
            total_reward += reward
            if done:
                break
        # Note that the observation on the done=True frame
        # doesn't matter
        max_frame = self._obs_buffer.max(axis=0)

        return max_frame, total_reward, done, info

And, I found this code in the baseline’s,

 # calculate corresponding `steps` and `eval_interval` according to frameskip
    # = 1440 episodes if we count an episode as 6000 frames,
    # = 1080 episodes if we count an episode as 8000 frames.
    maximum_frames = 8640000
    if args.frame_skip is None:
        steps = maximum_frames
        eval_interval = 6000 * 100  # (approx.) every 100 episode (counts "1 episode = 6000 steps")
    else:
        steps = maximum_frames // args.frame_skip
        eval_interval = 6000 * 100 // args.frame_skip  # (approx.) every 100 episode (counts "1 episode = 6000 steps")

First gym.make() stucked in downloading MixinGradle-dcfaf61.jar

Almost 5 years ago

Nice! :slightly_smiling_face: wait for your dockerize with headless server @william_guss

First gym.make() stucked in downloading MixinGradle-dcfaf61.jar

Almost 5 years ago

https://github.com/rofl0r/proxychains-ng , you could ./configure && make, and then could help it.

First gym.make() stucked in downloading MixinGradle-dcfaf61.jar

Almost 5 years ago

proxychains4 java InstallCert files.minecraftforge.net

cp THE_created_file /usr/lib/jvm/java-8-openjdk-amd64/jre/lib/security/

do the save operations for repo1.maven.org and jitpack.io

Issues about launch environment with proxy&xvfb

Almost 5 years ago

The Crash report from /tmp/tmpv3pvyj7v/Minecraft/run/./crash-reports/crash-2019-08-02_20.36.54-client.txt

 1 ---- Minecraft Crash Report ----
  2 // Ooh. Shiny.
  3
  4 Time: 8/2/19 8:36 PM
  5 Description: Initializing game
  6
  7 org.lwjgl.LWJGLException: X Error - disp: 0x7efe24e321b0 serial: 125 error: BadValue (integer parameter out of range for operation) request_code: 151 minor_code    : 24
  8         at org.lwjgl.opengl.LinuxDisplay.globalErrorHandler(LinuxDisplay.java:320)
  9         at org.lwjgl.opengl.LinuxContextImplementation.nCreate(Native Method)
 10         at org.lwjgl.opengl.LinuxContextImplementation.create(LinuxContextImplementation.java:51)
 11         at org.lwjgl.opengl.ContextGL.<init>(ContextGL.java:132)
 12         at org.lwjgl.opengl.Display.create(Display.java:850)
 13         at org.lwjgl.opengl.Display.create(Display.java:757)
 14         at org.lwjgl.opengl.Display.create(Display.java:739)
 15         at net.minecraft.client.Minecraft.createDisplay(Minecraft.java:594)
 16         at net.minecraft.client.Minecraft.init(Minecraft.java:431)
 17         at net.minecraft.client.Minecraft.run(Minecraft.java:352)
 18         at net.minecraft.client.main.Main.main(SourceFile:124)
 19         at sun.reflect.NativeMethodAccessorImpl.invoke0(Native Method)
 20         at sun.reflect.NativeMethodAccessorImpl.invoke(NativeMethodAccessorImpl.java:62)
 21         at sun.reflect.DelegatingMethodAccessorImpl.invoke(DelegatingMethodAccessorImpl.java:43)
 22         at java.lang.reflect.Method.invoke(Method.java:498)
 23         at net.minecraft.launchwrapper.Launch.launch(Launch.java:135)
 24         at net.minecraft.launchwrapper.Launch.main(Launch.java:28)
 25         at sun.reflect.NativeMethodAccessorImpl.invoke0(Native Method)
 26         at sun.reflect.NativeMethodAccessorImpl.invoke(NativeMethodAccessorImpl.java:62)
 27         at sun.reflect.DelegatingMethodAccessorImpl.invoke(DelegatingMethodAccessorImpl.java:43)
 28         at java.lang.reflect.Method.invoke(Method.java:498)
 29         at net.minecraftforge.gradle.GradleStartCommon.launch(GradleStartCommon.java:97)
 30         at GradleStart.main(GradleStart.java:26)
 31
 32
 33 A detailed walkthrough of the error, its code path and all known details is as follows:
 34 ---------------------------------------------------------------------------------------
 35
 36 -- Head --
 37 Thread: Client thread
 38 Stacktrace:
 39         at org.lwjgl.opengl.LinuxDisplay.globalErrorHandler(LinuxDisplay.java:320)
 40         at org.lwjgl.opengl.LinuxContextImplementation.nCreate(Native Method)
 41         at org.lwjgl.opengl.LinuxContextImplementation.create(LinuxContextImplementation.java:51)
 42         at org.lwjgl.opengl.ContextGL.<init>(ContextGL.java:132)
 43         at org.lwjgl.opengl.Display.create(Display.java:850)
 44         at org.lwjgl.opengl.Display.create(Display.java:757)
 45         at org.lwjgl.opengl.Display.create(Display.java:739)
 46         at net.minecraft.client.Minecraft.createDisplay(Minecraft.java:594)
 47         at net.minecraft.client.Minecraft.init(Minecraft.java:431)
 48
 49 -- Initialization --
 50 Details:
 51 Stacktrace:
 52         at net.minecraft.client.Minecraft.run(Minecraft.java:352)
 53         at net.minecraft.client.main.Main.main(SourceFile:124)
 54         at sun.reflect.NativeMethodAccessorImpl.invoke0(Native Method)
 55         at sun.reflect.NativeMethodAccessorImpl.invoke(NativeMethodAccessorImpl.java:62)
 56         at sun.reflect.DelegatingMethodAccessorImpl.invoke(DelegatingMethodAccessorImpl.java:43)
 57         at java.lang.reflect.Method.invoke(Method.java:498)
 58         at net.minecraft.launchwrapper.Launch.launch(Launch.java:135)
 59         at net.minecraft.launchwrapper.Launch.main(Launch.java:28)
 60         at sun.reflect.NativeMethodAccessorImpl.invoke0(Native Method)
 61         at sun.reflect.NativeMethodAccessorImpl.invoke(NativeMethodAccessorImpl.java:62)
 62         at sun.reflect.DelegatingMethodAccessorImpl.invoke(DelegatingMethodAccessorImpl.java:43)
 63         at java.lang.reflect.Method.invoke(Method.java:498)
 64         at net.minecraftforge.gradle.GradleStartCommon.launch(GradleStartCommon.java:97)
 65         at GradleStart.main(GradleStart.java:26)
 66
 67 -- System Details --
 68 Details:
 69         Minecraft Version: 1.11.2
 70         Operating System: Linux (amd64) version 4.4.0-139-generic
 71         Java Version: 1.8.0_222, Private Build
 72         Java VM Version: OpenJDK 64-Bit Server VM (mixed mode), Private Build
 73         Memory: 831672888 bytes (793 MB) / 1374158848 bytes (1310 MB) up to 1908932608 bytes (1820 MB)
 74         JVM Flags: 1 total; -Xmx2G
 75         IntCache: cache: 0, tcache: 0, allocated: 0, tallocated: 0
 76         FML:
 77         Loaded coremods (and transformers):
 78 OverclockingPlugin (MalmoMod-0.37.0.jar)
 79   com.microsoft.Malmo.OverclockingClassTransformer
 80         Launched Version: 1.11.2
 81         LWJGL: 2.9.4
 82         OpenGL: ~~ERROR~~ RuntimeException: No OpenGL context found in the current thread.
 83         GL Caps:
 84         Using VBOs: Yes
 85         Is Modded: Definitely; Client brand changed to 'fml,forge'
 86         Type: Client (map_client.txt)
 87         Resource Packs:
 88         Current Language: ~~ERROR~~ NullPointerException: null
 89         Profiler Position: N/A (disabled)
 90         CPU: <unknown>

Issues about launch environment with proxy&xvfb

Almost 5 years ago

I think we could download all the dependencies now, but, I’m still stuck in this Crash.

ERROR:minerl.env.malmo.instance.620e9f:Current status: 1195/1196   99%
ERROR:minerl.env.malmo.instance.620e9f:Current status: 1195/1196   99%
ERROR:minerl.env.malmo.instance.620e9f::makeStart
ERROR:minerl.env.malmo.instance.620e9f::runClient
...............

ERROR:minerl.env.malmo.instance.620e9f:-- System Details --
ERROR:minerl.env.malmo.instance.620e9f:Details:
ERROR:minerl.env.malmo.instance.620e9f:	Minecraft Version: 1.11.2
ERROR:minerl.env.malmo.instance.620e9f:	Operating System: Linux (amd64) version 4.4.0-139-generic
ERROR:minerl.env.malmo.instance.620e9f:	Java Version: 1.8.0_222, Private Build
ERROR:minerl.env.malmo.instance.620e9f:	Java VM Version: OpenJDK 64-Bit Server VM (mixed mode), Private Build
ERROR:minerl.env.malmo.instance.620e9f:	Memory: 831672888 bytes (793 MB) / 1374158848 bytes (1310 MB) up to 1908932608 bytes (1820 MB)
ERROR:minerl.env.malmo.instance.620e9f:	JVM Flags: 1 total; -Xmx2G
ERROR:minerl.env.malmo.instance.620e9f:	IntCache: cache: 0, tcache: 0, allocated: 0, tallocated: 0
ERROR:minerl.env.malmo.instance.620e9f:	FML: 
ERROR:minerl.env.malmo.instance.620e9f:	Loaded coremods (and transformers): 
ERROR:minerl.env.malmo.instance.620e9f:OverclockingPlugin (MalmoMod-0.37.0.jar)
ERROR:minerl.env.malmo.instance.620e9f:  com.microsoft.Malmo.OverclockingClassTransformer
ERROR:minerl.env.malmo.instance.620e9f:	Launched Version: 1.11.2
ERROR:minerl.env.malmo.instance.620e9f:	LWJGL: 2.9.4
ERROR:minerl.env.malmo.instance.620e9f:	OpenGL: ~~ERROR~~ RuntimeException: No OpenGL context found in the current thread.
ERROR:minerl.env.malmo.instance.620e9f:	GL Caps: 
ERROR:minerl.env.malmo.instance.620e9f:	Using VBOs: Yes
ERROR:minerl.env.malmo.instance.620e9f:	Is Modded: Definitely; Client brand changed to 'fml,forge'
ERROR:minerl.env.malmo.instance.620e9f:	Type: Client (map_client.txt)
ERROR:minerl.env.malmo.instance.620e9f:	Resource Packs: 
ERROR:minerl.env.malmo.instance.620e9f:	Current Language: ~~ERROR~~ NullPointerException: null
ERROR:minerl.env.malmo.instance.620e9f:	Profiler Position: N/A (disabled)
ERROR:minerl.env.malmo.instance.620e9f:	CPU: <unknown>
ERROR:minerl.env.malmo.instance.620e9f:[20:36:54] [Client thread/INFO]: [net.minecraft.init.Bootstrap:printToSYSOUT:523]: #@!@# Game crashed! Crash report saved to: #@!@# /tmp/tmpv3pvyj7v/Minecraft/run/./crash-reports/crash-2019-08-02_20.36.54-client.txt
ERROR:minerl.env.malmo.instance.620e9f::runClient FAILED
ERROR:minerl.env.malmo.instance.620e9f:
ERROR:minerl.env.malmo.instance.620e9f:FAILURE: Build failed with an exception.
ERROR:minerl.env.malmo.instance.620e9f:
ERROR:minerl.env.malmo.instance.620e9f:* What went wrong:
ERROR:minerl.env.malmo.instance.620e9f:Execution failed for task ':runClient'.
ERROR:minerl.env.malmo.instance.620e9f:> Process 'command '/usr/lib/jvm/java-8-openjdk-amd64/bin/java'' finished with non-zero exit value 255
ERROR:minerl.env.malmo.instance.620e9f:
ERROR:minerl.env.malmo.instance.620e9f:* Try:
ERROR:minerl.env.malmo.instance.620e9f:Run with --info or --debug option to get more log output.
ERROR:minerl.env.malmo.instance.620e9f:
ERROR:minerl.env.malmo.instance.620e9f:* Exception is:
ERROR:minerl.env.malmo.instance.620e9f:org.gradle.api.tasks.TaskExecutionException: Execution failed for task ':runClient'.
ERROR:minerl.env.malmo.instance.620e9f:	at org.gradle.api.internal.tasks.execution.ExecuteActionsTaskExecuter.executeActions(ExecuteActionsTaskExecuter.java:69)
ERROR:minerl.env.malmo.instance.620e9f:	at org.gradle.api.internal.tasks.execution.ExecuteActionsTaskExecuter.execute(ExecuteActionsTaskExecuter.java:46)
ERROR:minerl.env.malmo.instance.620e9f:	at org.gradle.api.internal.tasks.execution.PostExecutionAnalysisTaskExecuter.execute(PostExecutionAnalysisTaskExecuter.java:35)
ERROR:minerl.env.malmo.instance.620e9f:	at org.gradle.api.internal.tasks.execution.SkipUpToDateTaskExecuter.execute(SkipUpToDateTaskExecuter.java:66)
ERROR:minerl.env.malmo.instance.620e9f:	at org.gradle.api.internal.tasks.execution.ValidatingTaskExecuter.execute(ValidatingTaskExecuter.java:58)
ERROR:minerl.env.malmo.instance.620e9f:	at org.gradle.api.internal.tasks.execution.SkipEmptySourceFilesTaskExecuter.execute(SkipEmptySourceFilesTaskExecuter.java:52)
ERROR:minerl.env.malmo.instance.620e9f:	at org.gradle.api.internal.tasks.execution.SkipTaskWithNoActionsExecuter.execute(SkipTaskWithNoActionsExecuter.java:52)
ERROR:minerl.env.malmo.instance.620e9f:	at org.gradle.api.internal.tasks.execution.SkipOnlyIfTaskExecuter.execute(SkipOnlyIfTaskExecuter.java:53)
ERROR:minerl.env.malmo.instance.620e9f:	at org.gradle.api.internal.tasks.execution.ExecuteAtMostOnceTaskExecuter.execute(ExecuteAtMostOnceTaskExecuter.java:43)
ERROR:minerl.env.malmo.instance.620e9f:	at org.gradle.execution.taskgraph.DefaultTaskGraphExecuter$EventFiringTaskWorker.execute(DefaultTaskGraphExecuter.java:203)
ERROR:minerl.env.malmo.instance.620e9f:	at org.gradle.execution.taskgraph.DefaultTaskGraphExecuter$EventFiringTaskWorker.execute(DefaultTaskGraphExecuter.java:185)
ERROR:minerl.env.malmo.instance.620e9f:	at org.gradle.execution.taskgraph.AbstractTaskPlanExecutor$TaskExecutorWorker.processTask(AbstractTaskPlanExecutor.java:66)
ERROR:minerl.env.malmo.instance.620e9f:	at org.gradle.execution.taskgraph.AbstractTaskPlanExecutor$TaskExecutorWorker.run(AbstractTaskPlanExecutor.java:50)
ERROR:minerl.env.malmo.instance.620e9f:	at org.gradle.execution.taskgraph.DefaultTaskPlanExecutor.process(DefaultTaskPlanExecutor.java:25)
ERROR:minerl.env.malmo.instance.620e9f:	at org.gradle.execution.taskgraph.DefaultTaskGraphExecuter.execute(DefaultTaskGraphExecuter.java:110)
ERROR:minerl.env.malmo.instance.620e9f:	at org.gradle.execution.SelectedTaskExecutionAction.execute(SelectedTaskExecutionAction.java:37)
ERROR:minerl.env.malmo.instance.620e9f:	at org.gradle.execution.DefaultBuildExecuter.execute(DefaultBuildExecuter.java:37)
ERROR:minerl.env.malmo.instance.620e9f:	at org.gradle.execution.DefaultBuildExecuter.access$000(DefaultBuildExecuter.java:23)
ERROR:minerl.env.malmo.instance.620e9f:	at org.gradle.execution.DefaultBuildExecuter$1.proceed(DefaultBuildExecuter.java:43)
ERROR:minerl.env.malmo.instance.620e9f:	at org.gradle.execution.DryRunBuildExecutionAction.execute(DryRunBuildExecutionAction.java:32)
ERROR:minerl.env.malmo.instance.620e9f:	at org.gradle.execution.DefaultBuildExecuter.execute(DefaultBuildExecuter.java:37)
ERROR:minerl.env.malmo.instance.620e9f:	at org.gradle.execution.DefaultBuildExecuter.execute(DefaultBuildExecuter.java:30)
ERROR:minerl.env.malmo.instance.620e9f:	at org.gradle.initialization.DefaultGradleLauncher$4.run(DefaultGradleLauncher.java:153)
ERROR:minerl.env.malmo.instance.620e9f:	at org.gradle.internal.Factories$1.create(Factories.java:22)
ERROR:minerl.env.malmo.instance.620e9f:	at org.gradle.internal.progress.DefaultBuildOperationExecutor.run(DefaultBuildOperationExecutor.java:91)
ERROR:minerl.env.malmo.instance.620e9f:	at org.gradle.internal.progress.DefaultBuildOperationExecutor.run(DefaultBuildOperationExecutor.java:53)
ERROR:minerl.env.malmo.instance.620e9f:	at org.gradle.initialization.DefaultGradleLauncher.doBuildStages(DefaultGradleLauncher.java:150)
ERROR:minerl.env.malmo.instance.620e9f:	at org.gradle.initialization.DefaultGradleLauncher.access$200(DefaultGradleLauncher.java:32)
ERROR:minerl.env.malmo.instance.620e9f:	at org.gradle.initialization.DefaultGradleLauncher$1.create(DefaultGradleLauncher.java:98)
ERROR:minerl.env.malmo.instance.620e9f:	at org.gradle.initialization.DefaultGradleLauncher$1.create(DefaultGradleLauncher.java:92)
ERROR:minerl.env.malmo.instance.620e9f:	at org.gradle.internal.progress.DefaultBuildOperationExecutor.run(DefaultBuildOperationExecutor.java:91)
ERROR:minerl.env.malmo.instance.620e9f:	at org.gradle.internal.progress.DefaultBuildOperationExecutor.run(DefaultBuildOperationExecutor.java:63)
ERROR:minerl.env.malmo.instance.620e9f:	at org.gradle.initialization.DefaultGradleLauncher.doBuild(DefaultGradleLauncher.java:92)
ERROR:minerl.env.malmo.instance.620e9f:	at org.gradle.initialization.DefaultGradleLauncher.run(DefaultGradleLauncher.java:83)
ERROR:minerl.env.malmo.instance.620e9f:	at org.gradle.launcher.exec.InProcessBuildActionExecuter$DefaultBuildController.run(InProcessBuildActionExecuter.java:99)
ERROR:minerl.env.malmo.instance.620e9f:	at org.gradle.tooling.internal.provider.ExecuteBuildActionRunner.run(ExecuteBuildActionRunner.java:28)
ERROR:minerl.env.malmo.instance.620e9f:	at org.gradle.launcher.exec.ChainingBuildActionRunner.run(ChainingBuildActionRunner.java:35)
ERROR:minerl.env.malmo.instance.620e9f:	at org.gradle.launcher.exec.InProcessBuildActionExecuter.execute(InProcessBuildActionExecuter.java:48)
ERROR:minerl.env.malmo.instance.620e9f:	at org.gradle.launcher.exec.InProcessBuildActionExecuter.execute(InProcessBuildActionExecuter.java:30)
ERROR:minerl.env.malmo.instance.620e9f:	at org.gradle.launcher.exec.ContinuousBuildActionExecuter.execute(ContinuousBuildActionExecuter.java:81)
ERROR:minerl.env.malmo.instance.620e9f:	at org.gradle.launcher.exec.ContinuousBuildActionExecuter.execute(ContinuousBuildActionExecuter.java:46)
ERROR:minerl.env.malmo.instance.620e9f:	at org.gradle.launcher.exec.DaemonUsageSuggestingBuildActionExecuter.execute(DaemonUsageSuggestingBuildActionExecuter.java:51)
ERROR:minerl.env.malmo.instance.620e9f:	at org.gradle.launcher.exec.DaemonUsageSuggestingBuildActionExecuter.execute(DaemonUsageSuggestingBuildActionExecuter.java:28)
ERROR:minerl.env.malmo.instance.620e9f:	at org.gradle.launcher.cli.RunBuildAction.run(RunBuildAction.java:43)
ERROR:minerl.env.malmo.instance.620e9f:	at org.gradle.internal.Actions$RunnableActionAdapter.execute(Actions.java:173)
ERROR:minerl.env.malmo.instance.620e9f:	at org.gradle.launcher.cli.CommandLineActionFactory$ParseAndBuildAction.execute(CommandLineActionFactory.java:239)
ERROR:minerl.env.malmo.instance.620e9f:	at org.gradle.launcher.cli.CommandLineActionFactory$ParseAndBuildAction.execute(CommandLineActionFactory.java:212)
ERROR:minerl.env.malmo.instance.620e9f:	at org.gradle.launcher.cli.JavaRuntimeValidationAction.execute(JavaRuntimeValidationAction.java:35)
ERROR:minerl.env.malmo.instance.620e9f:	at org.gradle.launcher.cli.JavaRuntimeValidationAction.execute(JavaRuntimeValidationAction.java:24)
ERROR:minerl.env.malmo.instance.620e9f:	at org.gradle.launcher.cli.ExceptionReportingAction.execute(ExceptionReportingAction.java:33)
ERROR:minerl.env.malmo.instance.620e9f:	at org.gradle.launcher.cli.ExceptionReportingAction.execute(ExceptionReportingAction.java:22)
ERROR:minerl.env.malmo.instance.620e9f:	at org.gradle.launcher.cli.CommandLineActionFactory$WithLogging.execute(CommandLineActionFactory.java:205)
ERROR:minerl.env.malmo.instance.620e9f:	at org.gradle.launcher.cli.CommandLineActionFactory$WithLogging.execute(CommandLineActionFactory.java:169)
ERROR:minerl.env.malmo.instance.620e9f:	at org.gradle.launcher.Main.doAction(Main.java:33)
ERROR:minerl.env.malmo.instance.620e9f:	at org.gradle.launcher.bootstrap.EntryPoint.run(EntryPoint.java:45)
ERROR:minerl.env.malmo.instance.620e9f:	at org.gradle.launcher.bootstrap.ProcessBootstrap.runNoExit(ProcessBootstrap.java:55)
ERROR:minerl.env.malmo.instance.620e9f:	at org.gradle.launcher.bootstrap.ProcessBootstrap.run(ProcessBootstrap.java:36)
ERROR:minerl.env.malmo.instance.620e9f:	at org.gradle.launcher.GradleMain.main(GradleMain.java:23)
ERROR:minerl.env.malmo.instance.620e9f:	at org.gradle.wrapper.BootstrapMainStarter.start(BootstrapMainStarter.java:30)
ERROR:minerl.env.malmo.instance.620e9f:	at org.gradle.wrapper.WrapperExecutor.execute(WrapperExecutor.java:127)
ERROR:minerl.env.malmo.instance.620e9f:	at org.gradle.wrapper.GradleWrapperMain.main(GradleWrapperMain.java:61)
ERROR:minerl.env.malmo.instance.620e9f:Caused by: org.gradle.process.internal.ExecException: Process 'command '/usr/lib/jvm/java-8-openjdk-amd64/bin/java'' finished with non-zero exit value 255
ERROR:minerl.env.malmo.instance.620e9f:	at org.gradle.process.internal.DefaultExecHandle$ExecResultImpl.assertNormalExitValue(DefaultExecHandle.java:367)
ERROR:minerl.env.malmo.instance.620e9f:	at org.gradle.process.internal.DefaultJavaExecAction.execute(DefaultJavaExecAction.java:31)
ERROR:minerl.env.malmo.instance.620e9f:	at org.gradle.api.tasks.JavaExec.exec(JavaExec.java:74)
ERROR:minerl.env.malmo.instance.620e9f:	at org.gradle.internal.reflect.JavaMethod.invoke(JavaMethod.java:75)
ERROR:minerl.env.malmo.instance.620e9f:	at org.gradle.api.internal.project.taskfactory.AnnotationProcessingTaskFactory$StandardTaskAction.doExecute(AnnotationProcessingTaskFactory.java:228)
ERROR:minerl.env.malmo.instance.620e9f:	at org.gradle.api.internal.project.taskfactory.AnnotationProcessingTaskFactory$StandardTaskAction.execute(AnnotationProcessingTaskFactory.java:221)
ERROR:minerl.env.malmo.instance.620e9f:	at org.gradle.api.internal.project.taskfactory.AnnotationProcessingTaskFactory$StandardTaskAction.execute(AnnotationProcessingTaskFactory.java:210)
ERROR:minerl.env.malmo.instance.620e9f:	at org.gradle.api.internal.AbstractTask$TaskActionWrapper.execute(AbstractTask.java:621)
ERROR:minerl.env.malmo.instance.620e9f:	at org.gradle.api.internal.AbstractTask$TaskActionWrapper.execute(AbstractTask.java:604)
ERROR:minerl.env.malmo.instance.620e9f:	at org.gradle.api.internal.tasks.execution.ExecuteActionsTaskExecuter.executeAction(ExecuteActionsTaskExecuter.java:80)
ERROR:minerl.env.malmo.instance.620e9f:	at org.gradle.api.internal.tasks.execution.ExecuteActionsTaskExecuter.executeActions(ExecuteActionsTaskExecuter.java:61)
ERROR:minerl.env.malmo.instance.620e9f:	... 60 more
ERROR:minerl.env.malmo.instance.620e9f:
ERROR:minerl.env.malmo.instance.620e9f:
ERROR:minerl.env.malmo.instance.620e9f:BUILD FAILED
ERROR:minerl.env.malmo.instance.620e9f:
ERROR:minerl.env.malmo.instance.620e9f:Total time: 29 mins 13.147 secs

Issues about launch environment with proxy&xvfb

Almost 5 years ago

@fA2sEr After

  • update-ca-certificates
  • proxychains4 java InstallCert repo1.maven.org , and copy it into /usr/lib/jvm/java-8-openjdk-amd64/jre/lib/security path

it’s could download all the dependencies now

But,the run runClient failed !

[07:28:06] [main/ERROR]: The binary patch set is missing. Either you are in a development environment, or things are not going to work!
[07:28:06] [main/ERROR]: FML appears to be missing any signature data. This is not a good thing
[07:28:06] [main/INFO]: Calling tweak class net.minecraftforge.fml.relauncher.CoreModManager$FMLPluginWrapper
[07:28:06] [main/INFO]: Calling tweak class net.minecraftforge.fml.relauncher.CoreModManager$FMLPluginWrapper
[07:28:06] [main/INFO]: Calling tweak class org.spongepowered.asm.mixin.EnvironmentStateTweaker
[07:28:07] [main/INFO]: Initialised Mixin FML Remapper Adapter with net.minecraftforge.fml.common.asm.transformers.deobf.FMLDeobfuscatingRemapper@6d2260db
[07:28:07] [main/INFO]: Calling tweak class net.minecraftforge.fml.common.launcher.FMLDeobfTweaker
[07:28:07] [main/INFO]: Calling tweak class net.minecraftforge.gradle.tweakers.AccessTransformerTweaker
[07:28:07] [main/INFO]: Loading tweak class name net.minecraftforge.fml.common.launcher.TerminalTweaker
[07:28:07] [main/INFO]: Calling tweak class net.minecraftforge.fml.common.launcher.TerminalTweaker
[07:28:07] [main/WARN]: Reference map 'mixins.replaymod.refmap.json' for mixins.overclocking.malmomod.json could not be read. If this is a development environment you can ignore this message
[07:28:07] [main/INFO]: [com.microsoft.Malmo.OverclockingClassTransformer:transform:58]: MALMO: Attempting to transform MinecraftServer
[07:28:07] [main/INFO]: [com.microsoft.Malmo.OverclockingClassTransformer:overclockRenderer:129]: MALMO: Found Minecraft, attempting to transform it
[07:28:07] [main/INFO]: [com.microsoft.Malmo.OverclockingClassTransformer:overclockRenderer:135]: MALMO: Found Minecraft.runGameLoop() method, attempting to transform it
[07:28:07] [main/INFO]: [com.microsoft.Malmo.OverclockingClassTransformer:overclockRenderer:150]: MALMO: Hooked into call to Minecraft.updateDisplay()
[07:28:07] [main/INFO]: A re-entrant transformer '$wrapper.com.microsoft.Malmo.OverclockingClassTransformer' was detected and will no longer process meta class data
[07:28:07] [main/INFO]: Launching wrapped minecraft {net.minecraft.client.main.Main}
[07:28:07] [main/INFO]: [com.microsoft.Malmo.OverclockingClassTransformer:transform:58]: MALMO: Attempting to transform MinecraftServer
[07:28:07] [main/INFO]: [com.microsoft.Malmo.OverclockingClassTransformer:overclockRenderer:129]: MALMO: Found Minecraft, attempting to transform it
[07:28:07] [main/INFO]: [com.microsoft.Malmo.OverclockingClassTransformer:overclockRenderer:135]: MALMO: Found Minecraft.runGameLoop() method, attempting to transform it
[07:28:07] [main/INFO]: [com.microsoft.Malmo.OverclockingClassTransformer:overclockRenderer:150]: MALMO: Hooked into call to Minecraft.updateDisplay()
[07:28:08] [main/INFO]: [com.microsoft.Malmo.OverclockingClassTransformer:transform:42]: Transformed Name: net.minecraft.client.entity.EntityPlayerSP
[07:28:08] [main/INFO]: [com.microsoft.Malmo.OverclockingClassTransformer:transform:42]: Transformed Name: net.minecraft.client.entity.AbstractClientPlayer
No protocol specified
[07:28:08] [main/ERROR]: Unable to launch
java.lang.reflect.InvocationTargetException
        at sun.reflect.NativeMethodAccessorImpl.invoke0(Native Method) ~[?:1.8.0_222]
        at sun.reflect.NativeMethodAccessorImpl.invoke(NativeMethodAccessorImpl.java:62) ~[?:1.8.0_222]
        at sun.reflect.DelegatingMethodAccessorImpl.invoke(DelegatingMethodAccessorImpl.java:43) ~[?:1.8.0_222]
        at java.lang.reflect.Method.invoke(Method.java:498) ~[?:1.8.0_222]
        at net.minecraft.launchwrapper.Launch.launch(Launch.java:135) [launchwrapper-1.12.jar:?]
        at net.minecraft.launchwrapper.Launch.main(Launch.java:28) [launchwrapper-1.12.jar:?]
        at sun.reflect.NativeMethodAccessorImpl.invoke0(Native Method) ~[?:1.8.0_222]
        at sun.reflect.NativeMethodAccessorImpl.invoke(NativeMethodAccessorImpl.java:62) ~[?:1.8.0_222]
        at sun.reflect.DelegatingMethodAccessorImpl.invoke(DelegatingMethodAccessorImpl.java:43) ~[?:1.8.0_222]
        at java.lang.reflect.Method.invoke(Method.java:498) ~[?:1.8.0_222]
        at net.minecraftforge.gradle.GradleStartCommon.launch(GradleStartCommon.java:97) [start/:?]
        at GradleStart.main(GradleStart.java:26) [start/:?]
Caused by: java.awt.AWTError: Can't connect to X11 window server using ':0' as the value of the DISPLAY variable.
        at sun.awt.X11GraphicsEnvironment.initDisplay(Native Method) ~[?:1.8.0_222]
        at sun.awt.X11GraphicsEnvironment.access$200(X11GraphicsEnvironment.java:65) ~[?:1.8.0_222]
        at sun.awt.X11GraphicsEnvironment$1.run(X11GraphicsEnvironment.java:115) ~[?:1.8.0_222]
        at java.security.AccessController.doPrivileged(Native Method) ~[?:1.8.0_222]
        at sun.awt.X11GraphicsEnvironment.<clinit>(X11GraphicsEnvironment.java:74) ~[?:1.8.0_222]
Exception in thread "main"      at java.lang.Class.forName0(Native Method) ~[?:1.8.0_222]
        at java.lang.Class.forName(Class.java:264) ~[?:1.8.0_222]
        at java.awt.GraphicsEnvironment.createGE(GraphicsEnvironment.java:103) ~[?:1.8.0_222]
        at java.awt.GraphicsEnvironment.getLocalGraphicsEnvironment(GraphicsEnvironment.java:82) ~[?:1.8.0_222]
        at sun.awt.X11.XToolkit.<clinit>(XToolkit.java:132) ~[?:1.8.0_222]
        at java.lang.Class.forName0(Native Method) ~[?:1.8.0_222]
        at java.lang.Class.forName(Class.java:264) ~[?:1.8.0_222]
        at java.awt.Toolkit$2.run(Toolkit.java:860) ~[?:1.8.0_222]
        at java.awt.Toolkit$2.run(Toolkit.java:855) ~[?:1.8.0_222]
        at java.security.AccessController.doPrivileged(Native Method) ~[?:1.8.0_222]
        at java.awt.Toolkit.getDefaultToolkit(Toolkit.java:854) ~[?:1.8.0_222]
        at org.lwjgl.LinuxSysImplementation.<clinit>(LinuxSysImplementation.java:50) ~[lwjgl-2.9.4-nightly-20150209.jar:?]
        at org.lwjgl.Sys.createImplementation(Sys.java:131) ~[lwjgl-2.9.4-nightly-20150209.jar:?]
        at org.lwjgl.Sys.<clinit>(Sys.java:116) ~[lwjgl-2.9.4-nightly-20150209.jar:?]
        at net.minecraft.client.Minecraft.getSystemTime(Minecraft.java:2886) ~[Minecraft.class:?]
        at net.minecraft.client.main.Main.main(SourceFile:39) ~[Main.class:?]
        ... 12 more
[07:28:08] [main/INFO]: [java.lang.ThreadGroup:uncaughtException:1052]: java.lang.reflect.InvocationTargetException
[07:28:08] [main/INFO]: [java.lang.ThreadGroup:uncaughtException:1052]:         at sun.reflect.NativeMethodAccessorImpl.invoke0(Native Method)
[07:28:08] [main/INFO]: [java.lang.ThreadGroup:uncaughtException:1052]:         at sun.reflect.NativeMethodAccessorImpl.invoke(NativeMethodAccessorImpl.java:62)
[07:28:08] [main/INFO]: [java.lang.ThreadGroup:uncaughtException:1052]:         at sun.reflect.DelegatingMethodAccessorImpl.invoke(DelegatingMethodAccessorImpl.java:43)
[07:28:08] [main/INFO]: [java.lang.ThreadGroup:uncaughtException:1052]:         at java.lang.reflect.Method.invoke(Method.java:498)
[07:28:08] [main/INFO]: [java.lang.ThreadGroup:uncaughtException:1052]:         at net.minecraftforge.gradle.GradleStartCommon.launch(GradleStartCommon.java:97)
[07:28:08] [main/INFO]: [java.lang.ThreadGroup:uncaughtException:1052]:         at GradleStart.main(GradleStart.java:26)
[07:28:08] [main/INFO]: [java.lang.ThreadGroup:uncaughtException:1061]: Caused by: net.minecraftforge.fml.relauncher.FMLSecurityManager$ExitTrappedException
[07:28:08] [main/INFO]: [java.lang.ThreadGroup:uncaughtException:1061]:         at net.minecraftforge.fml.relauncher.FMLSecurityManager.checkPermission(FMLSecurityManager.java:49)
[07:28:08] [main/INFO]: [java.lang.ThreadGroup:uncaughtException:1061]:         at java.lang.SecurityManager.checkExit(SecurityManager.java:761)
[07:28:08] [main/INFO]: [java.lang.ThreadGroup:uncaughtException:1061]:         at java.lang.Runtime.exit(Runtime.java:107)
[07:28:08] [main/INFO]: [java.lang.ThreadGroup:uncaughtException:1061]:         at java.lang.System.exit(System.java:971)
[07:28:08] [main/INFO]: [java.lang.ThreadGroup:uncaughtException:1061]:         at net.minecraft.launchwrapper.Launch.launch(Launch.java:138)
[07:28:08] [main/INFO]: [java.lang.ThreadGroup:uncaughtException:1061]:         at net.minecraft.launchwrapper.Launch.main(Launch.java:28)
[07:28:08] [main/INFO]: [java.lang.ThreadGroup:uncaughtException:1061]:         ... 6 more
:runClient FAILED

FAILURE: Build failed with an exception.

* What went wrong:
Execution failed for task ':runClient'.
> Process 'command '/usr/lib/jvm/java-8-openjdk-amd64/bin/java'' finished with non-zero exit value 1

Issues about launch environment with proxy&xvfb

Almost 5 years ago

Thank you very much! I could get google.com by proxychains4 wget www.google.com, so, maybe the proxychains is work well;

May be the problem is https. certification now. :joy:

Trace as follows

FAILURE: Build failed with an exception.

* What went wrong:
Could not resolve all dependencies for configuration ':forgeGradleUserDevPackage'.
> Could not resolve net.minecraftforge:forge:1.11.2-13.20.0.2228.
  Required by:
      com.microsoft.MalmoMod:Minecraft:0.37.0
   > Could not resolve net.minecraftforge:forge:1.11.2-13.20.0.2228.
      > Could not get resource 'https://files.minecraftforge.net/maven/net/minecraftforge/forge/1.11.2-13.20.0.2228/forge-1.11.2-13.20.0.2228.pom'.
         > Could not GET 'https://files.minecraftforge.net/maven/net/minecraftforge/forge/1.11.2-13.20.0.2228/forge-1.11.2-13.20.0.2228.pom'.
            > sun.security.validator.ValidatorException: PKIX path building failed: sun.security.provider.certpath.SunCertPathBuilderException: unable to find                              valid certification path to requested target
   > Could not resolve net.minecraftforge:forge:1.11.2-13.20.0.2228.
      > Could not get resource 'https://repo1.maven.org/maven2/net/minecraftforge/forge/1.11.2-13.20.0.2228/forge-1.11.2-13.20.0.2228.pom'.
         > Could not GET 'https://repo1.maven.org/maven2/net/minecraftforge/forge/1.11.2-13.20.0.2228/forge-1.11.2-13.20.0.2228.pom'.
            > sun.security.validator.ValidatorException: PKIX path building failed: sun.security.provider.certpath.SunCertPathBuilderException: unable to find                              valid certification path to requested target

Issues about launch environment with proxy&xvfb

Almost 5 years ago

cool, guy

But, I’m stuck into jitpack.io yet. :joy:

INFO:minerl.env.malmo.instance.0e17f5:Starting Minecraft process: ['/tmp/tmp__29c0xm/Minecraft/launchClient.sh', '-port', '9001', '-env', '-runDir', '/tmp/tmp__29c0xm/Minecraft/run']
INFO:minerl.env.malmo.instance.0e17f5:Starting process watcher for process 115260 @ localhost:9001
DEBUG:minerl.env.malmo.instance.0e17f5:[proxychains] DLL init: proxychains-ng 4.14-git-4-g962373e
DEBUG:minerl.env.malmo.instance.0e17f5:[proxychains] DLL init: proxychains-ng 4.14-git-4-g962373e
DEBUG:minerl.env.malmo.instance.0e17f5:[proxychains] DLL init: proxychains-ng 4.14-git-4-g962373e
DEBUG:minerl.env.malmo.instance.0e17f5:[proxychains] DLL init: proxychains-ng 4.14-git-4-g962373e
DEBUG:minerl.env.malmo.instance.0e17f5:[proxychains] DLL init: proxychains-ng 4.14-git-4-g962373e
DEBUG:minerl.env.malmo.instance.0e17f5:[proxychains] DLL init: proxychains-ng 4.14-git-4-g962373e
DEBUG:minerl.env.malmo.instance.0e17f5:[proxychains] DLL init: proxychains-ng 4.14-git-4-g962373e
DEBUG:minerl.env.malmo.instance.0e17f5:[proxychains] DLL init: proxychains-ng 4.14-git-4-g962373e
DEBUG:minerl.env.malmo.instance.0e17f5:[proxychains] Strict chain  ...  10.21.*.*:3128  ...  10.21.*.*:3128  ...  OK
DEBUG:minerl.env.malmo.instance.0e17f5:[proxychains] Strict chain  ...  10.21.*.*:3128  ...  10.21.*.*:3128  ...  OK
DEBUG:minerl.env.malmo.instance.0e17f5:[proxychains] Strict chain  ...  10.21.*.*:3128  ...  10.21.*.*:3128  ...  OK
DEBUG:minerl.env.malmo.instance.0e17f5:[proxychains] Strict chain  ...  10.21.*.*:3128  ...  10.21.*.*:3128  ...  OK
DEBUG:minerl.env.malmo.instance.0e17f5:[proxychains] Strict chain  ...  10.21.*.*:3128  ...  10.21.*.*:3128  ...  OK
DEBUG:minerl.env.malmo.instance.0e17f5:[proxychains] Strict chain  ...  10.21.*.*:3128  ...  10.21.*.*:3128  ...  OK
DEBUG:minerl.env.malmo.instance.0e17f5:[proxychains] Strict chain  ...  10.21.*.*:3128  ...  10.21.*.*:3128  ...  OK
DEBUG:minerl.env.malmo.instance.0e17f5:[proxychains] Strict chain  ...  10.21.*.*:3128  ...  10.21.*.*:3128  ...  OK
DEBUG:minerl.env.malmo.instance.0e17f5:[proxychains] Strict chain  ...  10.21.*.*:3128  ...  10.21.*.*:3128  ...  OK
DEBUG:minerl.env.malmo.instance.0e17f5:[proxychains] Strict chain  ...  10.21.*.*:3128  ...  10.21.*.*:3128  ...  OK
DEBUG:minerl.env.malmo.instance.0e17f5:[proxychains] Strict chain  ...  10.21.*.*:3128  ...  10.21.*.*:3128  ...  OK
DEBUG:minerl.env.malmo.instance.0e17f5:[proxychains] Strict chain  ...  10.21.*.*:3128  ...  10.21.*.*:3128  ...  OK
DEBUG:minerl.env.malmo.instance.0e17f5:[proxychains] Strict chain  ...  10.21.*.*:3128  ...  10.21.*.*:3128  ...  OK
DEBUG:minerl.env.malmo.instance.0e17f5:[proxychains] Strict chain  ...  10.21.*.*:3128  ...  10.21.*.*:3128  ...  OK
DEBUG:minerl.env.malmo.instance.0e17f5:[proxychains] Strict chain  ...  10.21.*.*:3128  ...  10.21.*.*:3128  ...  OK
DEBUG:minerl.env.malmo.instance.0e17f5:[proxychains] Strict chain  ...  10.21.*.*:3128  ...  10.21.*.*:3128  ...  OK
DEBUG:minerl.env.malmo.instance.0e17f5:[proxychains] Strict chain  ...  10.21.*.*:3128  ...  10.21.*.*:3128  ...  OK
DEBUG:minerl.env.malmo.instance.0e17f5:[proxychains] Strict chain  ...  10.21.*.*:3128  ...  10.21.*.*:3128  ...  OK
DEBUG:minerl.env.malmo.instance.0e17f5:[proxychains] Strict chain  ...  10.21.*.*:3128  ...  10.21.*.*:3128  ...  OK
DEBUG:minerl.env.malmo.instance.0e17f5:[proxychains] Strict chain  ...  10.21.*.*:3128  ...  10.21.*.*:3128  ...  OK
DEBUG:minerl.env.malmo.instance.0e17f5:[proxychains] Strict chain  ...  10.21.*.*:3128  ...  10.21.*.*:3128  ...  OK
DEBUG:minerl.env.malmo.instance.0e17f5:[proxychains] Strict chain  ...  10.21.*.*:3128  ...  10.21.*.*:3128  ...  OK
DEBUG:minerl.env.malmo.instance.0e17f5:[proxychains] Strict chain  ...  10.21.*.*:3128  ...  10.21.*.*:3128  ...  OK
DEBUG:minerl.env.malmo.instance.0e17f5:[proxychains] Strict chain  ...  10.21.*.*:3128  ...  10.21.*.*:3128  ...  OK
DEBUG:minerl.env.malmo.instance.0e17f5:[proxychains] Strict chain  ...  10.21.*.*:3128  ...  10.21.*.*:3128  ...  OK
DEBUG:minerl.env.malmo.instance.0e17f5:[proxychains] Strict chain  ...  10.21.*.*:3128  ...  10.21.*.*:3128  ...  OK
DEBUG:minerl.env.malmo.instance.0e17f5:[proxychains] Strict chain  ...  10.21.*.*:3128  ...  10.21.*.*:3128  ...  OK
DEBUG:minerl.env.malmo.instance.0e17f5:[proxychains] Strict chain  ...  10.21.*.*:3128  ...  10.21.*.*:3128  ...  OK
DEBUG:minerl.env.malmo.instance.0e17f5:[proxychains] Strict chain  ...  10.21.*.*:3128  ...  10.21.*.*:3128  ...  OK
DEBUG:minerl.env.malmo.instance.0e17f5:[proxychains] Strict chain  ...  10.21.*.*:3128  ...  10.21.*.*:3128  ...  OK
DEBUG:minerl.env.malmo.instance.0e17f5:
DEBUG:minerl.env.malmo.instance.0e17f5:FAILURE: Build failed with an exception.
DEBUG:minerl.env.malmo.instance.0e17f5:
DEBUG:minerl.env.malmo.instance.0e17f5:* What went wrong:
DEBUG:minerl.env.malmo.instance.0e17f5:A problem occurred configuring root project 'Minecraft'.
DEBUG:minerl.env.malmo.instance.0e17f5:> Could not resolve all dependencies for configuration ':classpath'.
DEBUG:minerl.env.malmo.instance.0e17f5:   > Could not resolve com.github.SpongePowered:MixinGradle:dcfaf61.
DEBUG:minerl.env.malmo.instance.0e17f5:     Required by:
DEBUG:minerl.env.malmo.instance.0e17f5:         :Minecraft:unspecified
DEBUG:minerl.env.malmo.instance.0e17f5:      > Could not resolve com.github.SpongePowered:MixinGradle:dcfaf61.
DEBUG:minerl.env.malmo.instance.0e17f5:         > Could not get resource 'https://jitpack.io/com/github/SpongePowered/MixinGradle/dcfaf61/MixinGradle-dcfaf61.pom'.
DEBUG:minerl.env.malmo.instance.0e17f5:            > Could not GET 'https://jitpack.io/com/github/SpongePowered/MixinGradle/dcfaf61/MixinGradle-dcfaf61.pom'.
DEBUG:minerl.env.malmo.instance.0e17f5:               > sun.security.validator.ValidatorException: PKIX path building failed: sun.security.provider.certpath.SunCertPathBuilderException: unable to find valid certification path to requested target
DEBUG:minerl.env.malmo.instance.0e17f5:      > Could not resolve com.github.SpongePowered:MixinGradle:dcfaf61.
DEBUG:minerl.env.malmo.instance.0e17f5:         > Could not get resource 'https://repo1.maven.org/maven2/com/github/SpongePowered/MixinGradle/dcfaf61/MixinGradle-dcfaf61.pom'.
DEBUG:minerl.env.malmo.instance.0e17f5:            > Could not GET 'https://repo1.maven.org/maven2/com/github/SpongePowered/MixinGradle/dcfaf61/MixinGradle-dcfaf61.pom'.
DEBUG:minerl.env.malmo.instance.0e17f5:               > sun.security.validator.ValidatorException: PKIX path building failed: sun.security.provider.certpath.SunCertPathBuilderException: unable to find valid certification path to requested target
DEBUG:minerl.env.malmo.instance.0e17f5:

This is the same error with the usage of systemProp.http.proxyHost in gradle-wrapper.properties.

Issues about launch environment with proxy&xvfb

Almost 5 years ago

i follow this issue
https://github.com/microsoft/malmo/issues/221
set gradle.properties in my $HOME/.gradle

And then, raise PKIX path building failed

INFO:minerl.env.malmo.instance.9177f3:Starting Minecraft process: ['/tmp/tmpes0p__ok/Minecraft/launchClient.sh', '-port', '9001', '-env', '-runDir', '/tmp/tmpes0p__ok/Minecraft/run']
INFO:minerl.env.malmo.instance.9177f3:Starting process watcher for process 87740 @ localhost:9001
DEBUG:minerl.env.malmo.instance.9177f3:Downloading https://services.gradle.org/distributions/gradle-2.14-bin.zip
DEBUG:minerl.env.malmo.instance.9177f3:
DEBUG:minerl.env.malmo.instance.9177f3:Exception in thread "main" javax.net.ssl.SSLHandshakeException: sun.security.validator.ValidatorException: PKIX path building failed: sun.security.provider.certpath.SunCertPathBuilderException: unable to find valid certification path to requested target
DEBUG:minerl.env.malmo.instance.9177f3: at sun.security.ssl.Alerts.getSSLException(Alerts.java:192)
DEBUG:minerl.env.malmo.instance.9177f3: at sun.security.ssl.SSLSocketImpl.fatal(SSLSocketImpl.java:1946)
DEBUG:minerl.env.malmo.instance.9177f3: at sun.security.ssl.Handshaker.fatalSE(Handshaker.java:316)
DEBUG:minerl.env.malmo.instance.9177f3: at sun.security.ssl.Handshaker.fatalSE(Handshaker.java:310)
DEBUG:minerl.env.malmo.instance.9177f3: at sun.security.ssl.ClientHandshaker.serverCertificate(ClientHandshaker.java:1639)
DEBUG:minerl.env.malmo.instance.9177f3: at sun.security.ssl.ClientHandshaker.processMessage(ClientHandshaker.java:223)
DEBUG:minerl.env.malmo.instance.9177f3: at sun.security.ssl.Handshaker.processLoop(Handshaker.java:1037)
DEBUG:minerl.env.malmo.instance.9177f3: at sun.security.ssl.Handshaker.process_record(Handshaker.java:965)
DEBUG:minerl.env.malmo.instance.9177f3: at sun.security.ssl.SSLSocketImpl.readRecord(SSLSocketImpl.java:1064)
DEBUG:minerl.env.malmo.instance.9177f3: at sun.security.ssl.SSLSocketImpl.performInitialHandshake(SSLSocketImpl.java:1367)
DEBUG:minerl.env.malmo.instance.9177f3: at sun.security.ssl.SSLSocketImpl.startHandshake(SSLSocketImpl.java:1395)
DEBUG:minerl.env.malmo.instance.9177f3: at sun.security.ssl.SSLSocketImpl.startHandshake(SSLSocketImpl.java:1379)
DEBUG:minerl.env.malmo.instance.9177f3: at sun.net.www.protocol.https.HttpsClient.afterConnect(HttpsClient.java:559)
DEBUG:minerl.env.malmo.instance.9177f3: at sun.net.www.protocol.https.AbstractDelegateHttpsURLConnection.connect(AbstractDelegateHttpsURLConnection.java:185)
DEBUG:minerl.env.malmo.instance.9177f3: at sun.net.www.protocol.http.HttpURLConnection.followRedirect0(HttpURLConnection.java:2729)
DEBUG:minerl.env.malmo.instance.9177f3: at sun.net.www.protocol.http.HttpURLConnection.followRedirect(HttpURLConnection.java:2641)
DEBUG:minerl.env.malmo.instance.9177f3: at sun.net.www.protocol.http.HttpURLConnection.getInputStream0(HttpURLConnection.java:1824)
DEBUG:minerl.env.malmo.instance.9177f3: at sun.net.www.protocol.http.HttpURLConnection.getInputStream(HttpURLConnection.java:1492)
DEBUG:minerl.env.malmo.instance.9177f3: at sun.net.www.protocol.https.HttpsURLConnectionImpl.getInputStream(HttpsURLConnectionImpl.java:263)
DEBUG:minerl.env.malmo.instance.9177f3: at org.gradle.wrapper.Download.downloadInternal(Download.java:58)
DEBUG:minerl.env.malmo.instance.9177f3: at org.gradle.wrapper.Download.download(Download.java:44)
DEBUG:minerl.env.malmo.instance.9177f3: at org.gradle.wrapper.Install$1.call(Install.java:59)
DEBUG:minerl.env.malmo.instance.9177f3: at org.gradle.wrapper.Install$1.call(Install.java:46)
DEBUG:minerl.env.malmo.instance.9177f3: at org.gradle.wrapper.ExclusiveFileAccessManager.access(ExclusiveFileAccessManager.java:65)
DEBUG:minerl.env.malmo.instance.9177f3: at org.gradle.wrapper.Install.createDist(Install.java:46)
DEBUG:minerl.env.malmo.instance.9177f3: at org.gradle.wrapper.WrapperExecutor.execute(WrapperExecutor.java:126)
DEBUG:minerl.env.malmo.instance.9177f3: at org.gradle.wrapper.GradleWrapperMain.main(GradleWrapperMain.java:61)
DEBUG:minerl.env.malmo.instance.9177f3:Caused by: sun.security.validator.ValidatorException: PKIX path building failed: sun.security.provider.certpath.SunCertPathBuilderException: unable to find valid certification path to requested target
DEBUG:minerl.env.malmo.instance.9177f3: at sun.security.validator.PKIXValidator.doBuild(PKIXValidator.java:397)
DEBUG:minerl.env.malmo.instance.9177f3: at sun.security.validator.PKIXValidator.engineValidate(PKIXValidator.java:302)
DEBUG:minerl.env.malmo.instance.9177f3: at sun.security.validator.Validator.validate(Validator.java:262)
DEBUG:minerl.env.malmo.instance.9177f3: at sun.security.ssl.X509TrustManagerImpl.validate(X509TrustManagerImpl.java:324)
DEBUG:minerl.env.malmo.instance.9177f3: at sun.security.ssl.X509TrustManagerImpl.checkTrusted(X509TrustManagerImpl.java:229)
DEBUG:minerl.env.malmo.instance.9177f3: at sun.security.ssl.X509TrustManagerImpl.checkServerTrusted(X509TrustManagerImpl.java:124)
DEBUG:minerl.env.malmo.instance.9177f3: at sun.security.ssl.ClientHandshaker.serverCertificate(ClientHandshaker.java:1621)
DEBUG:minerl.env.malmo.instance.9177f3: ... 22 more
DEBUG:minerl.env.malmo.instance.9177f3:Caused by: sun.security.provider.certpath.SunCertPathBuilderException: unable to find valid certification path to requested target
DEBUG:minerl.env.malmo.instance.9177f3: at sun.security.provider.certpath.SunCertPathBuilder.build(SunCertPathBuilder.java:141)
DEBUG:minerl.env.malmo.instance.9177f3: at sun.security.provider.certpath.SunCertPathBuilder.engineBuild(SunCertPathBuilder.java:126)
DEBUG:minerl.env.malmo.instance.9177f3: at java.security.cert.CertPathBuilder.build(CertPathBuilder.java:280)
DEBUG:minerl.env.malmo.instance.9177f3: at sun.security.validator.PKIXValidator.doBuild(PKIXValidator.java:392)
DEBUG:minerl.env.malmo.instance.9177f3: ... 28 more
ERROR:minerl.env.malmo.instance.9177f3:Downloading https://services.gradle.org/distributions/gradle-2.14-bin.zip
ERROR:minerl.env.malmo.instance.9177f3:
ERROR:minerl.env.malmo.instance.9177f3:Exception in thread "main" javax.net.ssl.SSLHandshakeException: sun.security.validator.ValidatorException: PKIX path building failed: sun.security.provider.certpath.SunCertPathBuilderException: unable to find valid certification path to requested target
ERROR:minerl.env.malmo.instance.9177f3: at sun.security.ssl.Alerts.getSSLException(Alerts.java:192)
ERROR:minerl.env.malmo.instance.9177f3: at sun.security.ssl.SSLSocketImpl.fatal(SSLSocketImpl.java:1946)
ERROR:minerl.env.malmo.instance.9177f3: at sun.security.ssl.Handshaker.fatalSE(Handshaker.java:316)
ERROR:minerl.env.malmo.instance.9177f3: at sun.security.ssl.Handshaker.fatalSE(Handshaker.java:310)
ERROR:minerl.env.malmo.instance.9177f3: at sun.security.ssl.ClientHandshaker.serverCertificate(ClientHandshaker.java:1639)
ERROR:minerl.env.malmo.instance.9177f3: at sun.security.ssl.ClientHandshaker.processMessage(ClientHandshaker.java:223)
ERROR:minerl.env.malmo.instance.9177f3: at sun.security.ssl.Handshaker.processLoop(Handshaker.java:1037)
ERROR:minerl.env.malmo.instance.9177f3: at sun.security.ssl.Handshaker.process_record(Handshaker.java:965)
ERROR:minerl.env.malmo.instance.9177f3: at sun.security.ssl.SSLSocketImpl.readRecord(SSLSocketImpl.java:1064)
ERROR:minerl.env.malmo.instance.9177f3: at sun.security.ssl.SSLSocketImpl.performInitialHandshake(SSLSocketImpl.java:1367)
ERROR:minerl.env.malmo.instance.9177f3: at sun.security.ssl.SSLSocketImpl.startHandshake(SSLSocketImpl.java:1395)
ERROR:minerl.env.malmo.instance.9177f3: at sun.security.ssl.SSLSocketImpl.startHandshake(SSLSocketImpl.java:1379)
ERROR:minerl.env.malmo.instance.9177f3: at sun.net.www.protocol.https.HttpsClient.afterConnect(HttpsClient.java:559)
ERROR:minerl.env.malmo.instance.9177f3: at sun.net.www.protocol.https.AbstractDelegateHttpsURLConnection.connect(AbstractDelegateHttpsURLConnection.java:185)
ERROR:minerl.env.malmo.instance.9177f3: at sun.net.www.protocol.http.HttpURLConnection.followRedirect0(HttpURLConnection.java:2729)
ERROR:minerl.env.malmo.instance.9177f3: at sun.net.www.protocol.http.HttpURLConnection.followRedirect(HttpURLConnection.java:2641)
ERROR:minerl.env.malmo.instance.9177f3: at sun.net.www.protocol.http.HttpURLConnection.getInputStream0(HttpURLConnection.java:1824)
ERROR:minerl.env.malmo.instance.9177f3: at sun.net.www.protocol.http.HttpURLConnection.getInputStream(HttpURLConnection.java:1492)
ERROR:minerl.env.malmo.instance.9177f3: at sun.net.www.protocol.https.HttpsURLConnectionImpl.getInputStream(HttpsURLConnectionImpl.java:263)
ERROR:minerl.env.malmo.instance.9177f3: at org.gradle.wrapper.Download.downloadInternal(Download.java:58)
ERROR:minerl.env.malmo.instance.9177f3: at org.gradle.wrapper.Download.download(Download.java:44)
ERROR:minerl.env.malmo.instance.9177f3: at org.gradle.wrapper.Install$1.call(Install.java:59)
ERROR:minerl.env.malmo.instance.9177f3: at org.gradle.wrapper.Install$1.call(Install.java:46)
ERROR:minerl.env.malmo.instance.9177f3: at org.gradle.wrapper.ExclusiveFileAccessManager.access(ExclusiveFileAccessManager.java:65)
ERROR:minerl.env.malmo.instance.9177f3: at org.gradle.wrapper.Install.createDist(Install.java:46)
ERROR:minerl.env.malmo.instance.9177f3: at org.gradle.wrapper.WrapperExecutor.execute(WrapperExecutor.java:126)
ERROR:minerl.env.malmo.instance.9177f3: at org.gradle.wrapper.GradleWrapperMain.main(GradleWrapperMain.java:61)
ERROR:minerl.env.malmo.instance.9177f3:Caused by: sun.security.validator.ValidatorException: PKIX path building failed: sun.security.provider.certpath.SunCertPathBuilderException: unable to find valid certification path to requested target
ERROR:minerl.env.malmo.instance.9177f3: at sun.security.validator.PKIXValidator.doBuild(PKIXValidator.java:397)
ERROR:minerl.env.malmo.instance.9177f3: at sun.security.validator.PKIXValidator.engineValidate(PKIXValidator.java:302)
ERROR:minerl.env.malmo.instance.9177f3: at sun.security.validator.Validator.validate(Validator.java:262)
ERROR:minerl.env.malmo.instance.9177f3: at sun.security.ssl.X509TrustManagerImpl.validate(X509TrustManagerImpl.java:324)
ERROR:minerl.env.malmo.instance.9177f3: at sun.security.ssl.X509TrustManagerImpl.checkTrusted(X509TrustManagerImpl.java:229)
ERROR:minerl.env.malmo.instance.9177f3: at sun.security.ssl.X509TrustManagerImpl.checkServerTrusted(X509TrustManagerImpl.java:124)
ERROR:minerl.env.malmo.instance.9177f3: at sun.security.ssl.ClientHandshaker.serverCertificate(ClientHandshaker.java:1621)
ERROR:minerl.env.malmo.instance.9177f3: ... 22 more
ERROR:minerl.env.malmo.instance.9177f3:Caused by: sun.security.provider.certpath.SunCertPathBuilderException: unable to find valid certification path to requested target
ERROR:minerl.env.malmo.instance.9177f3: at sun.security.provider.certpath.SunCertPathBuilder.build(SunCertPathBuilder.java:141)
ERROR:minerl.env.malmo.instance.9177f3: at sun.security.provider.certpath.SunCertPathBuilder.engineBuild(SunCertPathBuilder.java:126)
ERROR:minerl.env.malmo.instance.9177f3: at java.security.cert.CertPathBuilder.build(CertPathBuilder.java:280)
ERROR:minerl.env.malmo.instance.9177f3: at sun.security.validator.PKIXValidator.doBuild(PKIXValidator.java:392)
ERROR:minerl.env.malmo.instance.9177f3: ... 28 more

weel2019 has not provided any information yet.