Loading
Task 2: Completed
44.7k
362
28
2071
ID Participant Status ▲ Score Message Challenge Submission
129223 Dexter failed 0.000

“TypeError: unhashable type: ‘numpy.ndarray’”

MABe Task 3: Learning New Behavior
View
167845 sindhu_venna failed 0.000

No more retries left

MABe Task 2: Annotation Style Transfer
View
134532 Dexter failed 0.000

“pod deleted”

MABe Task 3: Learning New Behavior
View
126901 behja_mrakch failed 0.000

“AssertionError: Submitted file doesnot contain predictions for all sequences.”

MABe Task 1: Classical Classification
View
167764 mnowicki6 failed 0.000

No more retries left

MABe Task 2: Annotation Style Transfer
View
128332 Dexter failed 0.830

“Evaluation timed out”

MABe Task 2: Annotation Style Transfer
View
127680 Dexter failed 0.000

“failed to load artifacts”

MABe Task 1: Classical Classification
View
131840 mrd failed 0.000

“Exception: Invalid Submission File”

MABe Task 1: Classical Classification
View
151230 jian_gao failed 0.000

AssertionError: Sequeunce id 3c8a57ba51 has a mismatch in the expected frame numbers in the predictions.

MABe Task 1: Classical Classification
View
134148 stefanos_fafalios failed 0.486

INTERNAL SERVER ERROR

MABe Task 2: Annotation Style Transfer
View